Gold
type: Material
type: Concept
alternative label: Aureum @la
change note: provenance
definition: 'AV' is the numismatic abbreviation for gold.
in scheme: id
preferred label: ذهب @ar
preferred label: Or @fr
preferred label: Aur @ro
preferred label: Золото @ru
preferred label: Goud @nl
preferred label: Oro @it
preferred label: Χρυσός @el
preferred label: злато @bg
preferred label: złoto @pl
preferred label: gull @nb
preferred label: oro @es
preferred label: સોનું @gu
preferred label: Gull @nn
preferred label: arany @hu
preferred label: goud @af
preferred label: ወርቅ @am
preferred label: Quri @ay
preferred label: Qızıl @az
preferred label: Алтын @ba
preferred label: Золата @be
preferred label: সোনা @bn
preferred label: Aour @br
preferred label: Zlato @bs
preferred label: or @ca
preferred label: Oru @co
preferred label: zlato @cs
preferred label: Ылтăн @cv
preferred label: guld @da
preferred label: Kuld @et
preferred label: Urre @eu
preferred label: طلا @fa
preferred label: kulta @fi
preferred label: Ór @ga
preferred label: Òr @gd
preferred label: Ouro @gl
preferred label: Kuarepotiju @gn
preferred label: Airh @gv
preferred label: זהב @he
preferred label: सोना @hi
preferred label: Lò @ht
preferred label: Ոսկի @hy
preferred label: Auro @ia
preferred label: Emas @id
preferred label: 金 @ja
preferred label: ოქრო @ka
preferred label: Wolo @kg
preferred label: Kuulti @kl
preferred label: ಚಿನ್ನ @kn
preferred label: 금 @ko
preferred label: سۄن @ks
preferred label: Zêr @ku
preferred label: Зарни @kv
preferred label: Aurum @la
preferred label: Wólo @ln
preferred label: Auksas @lt
preferred label: Zelts @lv
preferred label: Volamena @mg
preferred label: സ്വർണം @ml
preferred label: Алт @mn
preferred label: सोने @mr
preferred label: ရွှေ @my
preferred label: सुन @ne
preferred label: Óola @nv
preferred label: Сызгъæрин @os
preferred label: ਸੋਨਾ @pa
preferred label: ouro @pt
preferred label: सुवर्णम् @sa
preferred label: Ari @sq
preferred label: Guld @sv
preferred label: Dhahabu @sw
preferred label: தங்கம் @ta
preferred label: బంగారం @te
preferred label: Зар @tg
preferred label: ทองคำ @th

Augustus
type: Person
type: Concept
birth: birth
death: death
is part of: roman numismatics
member of: julio-claudian dynasty
change note: provenance
definition: Roman Emperor from 16 January 27 BC to 19 August AD 14.
in scheme: id
preferred label: Auguste @fr
preferred label: Август @ru
preferred label: Augusto @it
preferred label: Αύγουστος @el
preferred label: 奥古斯都 @zh
preferred label: August @ca
preferred label: Октавіан Август @uk
preferred label: César Augusto @es
preferred label: Caius Octavianus Caesar Augustus @hu
preferred label: 아우구스투스 @ko
preferred label: Oktawian August @pl
preferred label: アウグストゥス @ja
preferred label: Gaius Julius Caesar Augustus @nb
preferred label: Augustus Octavianus @af
preferred label: أغسطس @ar
preferred label: Oktavian Avqust @az
preferred label: Актавіян Аўгуст @be
preferred label: আউগুস্তুস @bn
preferred label: ཨའོ་ཀུའུ་སི་ཏུའུ། @bo
preferred label: Aogust @br
preferred label: Oktavijan August @bs
preferred label: Aŭgusto Cezaro @eo
preferred label: Zesar Augusto @eu
preferred label: آگوستوس @fa
preferred label: Augustus Oktavianus @fy
preferred label: Ágastas @ga
preferred label: Octavio Augusto @gl
preferred label: אוגוסטוס קיסר @he
preferred label: आगस्टस कैसर @hi
preferred label: Օկտավիանոս Օգոստոս @hy
preferred label: Cesare Augusto @ia
preferred label: Octavianus @id
preferred label: Ágústus @is
preferred label: ოქტავიანე ავგუსტუსი @ka
preferred label: ಅಗಸ್ಟಸ್ @kn
preferred label: Augustas @lt
preferred label: Oktaviāns @lv
preferred label: Октавијан Август @mk
preferred label: അഗസ്റ്റസ് @ml
preferred label: Август Цезарь @mn
preferred label: ऑगस्टस @mr
preferred label: ဩဂတ်စတက်ဆီဇာ @my
preferred label: Augustus av Romarriket @nn
preferred label: ଅଗଷ୍ଟସ @or
preferred label: Octavianus Augustus @sk
preferred label: Gaj Avgust Oktavijan @sl
preferred label: Aokuso Kaisara @sm
preferred label: Augusti @sq
preferred label: அகஸ்ட்டஸ் @ta
preferred label: จักรพรรดิออกัสตัส @th
preferred label: Oktawian Awgust @tk
preferred label: Cesar Augusto @tl
preferred label: Caesar Divi Filius Augustus @tr
preferred label: آگسٹس @ur
preferred label: Impreur Ågusse @wa
preferred label: אויגוסטוס @yi
preferred label: Октавиан Август @kk
preferred label: Avgust @uz
preferred label: ਆਗਸਟਸ ਕੈਸਰ @pa
preferred label: አውግስጦስ @am
preferred label: ᐊᐅᒍᔅᒻᐅᔅ @iu
preferred label: Augustus Octavian @so
preferred label: អូហ្គុសទុស @km
preferred label: ఆగస్టస్ @te
preferred label: Keizer Augustus @li
preferred label: Баалбак @tg
preferred label: ඔගස්ටස් @si
preferred label: अगस्टस @ne

this
type: SpatialThing
is part of: this
lat: 41.9
long: 12.5

http://nomisma.org/id/augustus#membership_348ddaf09df067abdbdd6ed4516a1f53
type: Membership
topic: Augustus
has end date: 0014
has start date: -0027
organization: roman empire
role: roman emperor

Rome
type: Mint
type: Concept
is part of: roman numismatics
location: this
broader: latium
change note: provenance
definition: The mint at the ancient site of Rome in Latium.
in scheme: id
preferred label: Roma @it
preferred label: Ρώμη @el
preferred label: 古罗马 @zh
preferred label: Řím @cs
preferred label: Рим @uk
preferred label: Róma @hu
preferred label: 古代ローマ @ja
preferred label: Rzym @pl
preferred label: 고대 로마 @ko
preferred label: Romerska @sv
preferred label: Rooman @fi
preferred label: โรมโบราณ @th
preferred label: Romio @eo
preferred label: Рум @tg
preferred label: রোম @bn
preferred label: रोम @hi
preferred label: An Ròimh @gd
preferred label: Rím @sk
preferred label: Rom @ff
preferred label: Rómù @yo
preferred label: רוים @yi
preferred label: An Róimh @ga
preferred label: ರೋಮ್ @kn
preferred label: உரோமை நகரம் @ta
preferred label: רומא @he
preferred label: Ром @mn
preferred label: Rim @sl
preferred label: Roum @lb
preferred label: روم @ps
preferred label: ሮማ @ti
preferred label: Yn Raue @gv
preferred label: Հռոմ @hy
preferred label: روما @ar
preferred label: رىم @ug
preferred label: ရောမမြို့ @my
preferred label: Rooma @et
preferred label: ରୋମ @or
preferred label: Rhufain @cy
preferred label: Róm @fo
preferred label: Ruma @mt
preferred label: Roeme @li
preferred label: રોમ @gu
preferred label: ਰੋਮ @pa
preferred label: රෝමය @si
preferred label: ទីក្រុងរ៉ូម @km
preferred label: ᖌᒪ @cr
preferred label: Erroma @eu
preferred label: رم @fa
preferred label: రోమ్ @te
preferred label: Римъ @cu
preferred label: Ròm @ht
preferred label: Рым @be
preferred label: რომი @ka
preferred label: རོ་མ། @bo
preferred label: Rōma @mi
preferred label: Romë @sq
preferred label: റോം @ml
preferred label: रोमा @sa
preferred label: ໂຣມ @lo

provenance
type: ProvenanceStatement
topic: Rome
activity: Activity
  type: Modify
  type: spreadsheet
  at time: 2015-10-24T04:00:03+00:00
  used: pubhtml
  was associated with: egruber
activity: Activity
  type: Modify
  type: manual
  at time: 2017-01-27T20:18:19+00:00
activity: Activity
  type: Modify
  type: manual
  at time: 2022-07-13T15:30:36.211000+00:00
  was associated with: egruber
was generated by: Activity
  type: Create
  description: This is among the original Nomisma XHTML+RDFa fragments, most likely created between 2010-2012 by Sebastian Heath and/or Andy Meadows.
  type: manual
  at time: 2012-10-28T21:43:36+00:00
  was associated with: ameadows
  was associated with: sfsheath

provenance
type: ProvenanceStatement
topic: Gold
activity: Activity
  type: Modify
  type: spreadsheet
  at time: 2018-07-26T04:00:01-05:00
  used: pubhtml
  was associated with: egruber
was generated by: Activity
  type: Create
  description: This is among the original Nomisma XHTML+RDFa fragments, most likely created between 2010-2012 by Sebastian Heath and/or Andy Meadows.
  type: manual
  at time: 2012-10-28T21:43:36+00:00
  was associated with: ameadows
  was associated with: sfsheath

death
type: Death
date: 0014-09-19

Aureus
type: Denomination
type: Concept
is part of: roman numismatics
has material: Gold
change note: provenance
definition: Roman-period gold coin.
in scheme: id
note: In the early imperial system established by Augustus, an aureus was worth 25 denarii, 100 sestertii, and 400 asses.
preferred label: Ауреус @ru
preferred label: Aureo @it
preferred label: アウレウス @ja
preferred label: Áureo @es
preferred label: Aуреус @bg
preferred label: Աուրեուս @hy
preferred label: აურეუსი @ka
preferred label: Aurėjas @lt

birth
type: Birth
date: -0063-09-23

provenance
type: ProvenanceStatement
topic: Aureus
activity: Activity
  type: Modify
  type: manual
  at time: 2017-04-28T19:10:55+00:00
activity: Activity
  type: Modify
  type: manual
  at time: 2021-06-16T08:03:25.044000-05:00
  was associated with: kdahmen
was generated by: Activity
  type: Create
  description: This is among the original Nomisma XHTML+RDFa fragments, most likely created between 2010-2012 by Sebastian Heath and/or Andy Meadows.
  type: manual
  at time: 2012-10-28T21:43:36+00:00
  was associated with: ameadows
  was associated with: sfsheath

provenance
type: ProvenanceStatement
topic: Augustus
activity: Activity
  type: Modify
  type: manual
  at time: 2017-01-27T20:18:19+00:00
activity: Activity
  type: Modify
  type: spreadsheet
  at time: 2024-04-19T18:12:48.400000+00:00
  used: pubhtml
  was associated with: egruber
was generated by: Activity
  type: Create
  description: This is among the original Nomisma XHTML+RDFa fragments, most likely created between 2010-2012 by Sebastian Heath and/or Andy Meadows.
  type: manual
  at time: 2012-10-28T21:43:36+00:00
  was associated with: ameadows
  was associated with: sfsheath