object,title,identifiers,findUri,findspot,hoard,collection,publisher,dataset,datasetTitle,weight,axis,diameter,obvThumb,revThumb,obvRef,revRef,comThumb,comRef,obvManifest,revManifest,comManifest,model
http://numismatics.org/collection/1960.170.225,"Silver Denarius of Hadrian, Rome, AD 120 - AD 121 1960.170.225",1960.170.225,,,,American Numismatic Society,American Numismatic Society,http://numismatics.org/search/,American Numismatic Society,3.04,5,17.5,https://numismatics.org/collectionimages/19501999/1960/1960.170.225.obv.width175.jpg,https://numismatics.org/collectionimages/19501999/1960/1960.170.225.rev.width175.jpg,https://numismatics.org/collectionimages/19501999/1960/1960.170.225.obv.width350.jpg,https://numismatics.org/collectionimages/19501999/1960/1960.170.225.rev.width350.jpg,,,https://images.numismatics.org/collectionimages%2F19501999%2F1960%2F1960.170.225.obv.noscale.jpg/info.json,https://images.numismatics.org/collectionimages%2F19501999%2F1960%2F1960.170.225.rev.noscale.jpg/info.json,,
http://numismatics.org/collection/1956.127.116,"Silver Denarius of Hadrian, Rome, AD 120 - AD 121 1956.127.116",1956.127.116,,,,American Numismatic Society,American Numismatic Society,http://numismatics.org/search/,American Numismatic Society,3.38,6,18.0,https://numismatics.org/collectionimages/19501999/1956/1956.127.116.obv.width175.jpg,https://numismatics.org/collectionimages/19501999/1956/1956.127.116.rev.width175.jpg,https://numismatics.org/collectionimages/19501999/1956/1956.127.116.obv.width350.jpg,https://numismatics.org/collectionimages/19501999/1956/1956.127.116.rev.width350.jpg,,,https://images.numismatics.org/collectionimages%2F19501999%2F1956%2F1956.127.116.obv.noscale.jpg/info.json,https://images.numismatics.org/collectionimages%2F19501999%2F1956%2F1956.127.116.rev.noscale.jpg/info.json,,
http://numismatics.org/collection/1956.127.1758,"Silver Denarius of Hadrian, Rome, AD 120 - AD 121 1956.127.1758",1956.127.1758,,,,American Numismatic Society,American Numismatic Society,http://numismatics.org/search/,American Numismatic Society,3.26,6,18.0,https://numismatics.org/collectionimages/19501999/1956/1956.127.1758.obv.width175.jpg,https://numismatics.org/collectionimages/19501999/1956/1956.127.1758.rev.width175.jpg,https://numismatics.org/collectionimages/19501999/1956/1956.127.1758.obv.width350.jpg,https://numismatics.org/collectionimages/19501999/1956/1956.127.1758.rev.width350.jpg,,,https://images.numismatics.org/collectionimages%2F19501999%2F1956%2F1956.127.1758.obv.noscale.jpg/info.json,https://images.numismatics.org/collectionimages%2F19501999%2F1956%2F1956.127.1758.rev.noscale.jpg/info.json,,
http://numismatics.org/collection/1985.140.97,"Silver Denarius of Hadrian, Rome, AD 120 - AD 121 1985.140.97",1985.140.97,,,,American Numismatic Society,American Numismatic Society,http://numismatics.org/search/,American Numismatic Society,2.92,6,19.0,https://numismatics.org/collectionimages/19501999/1985/1985.140.97.obv.width175.jpg,https://numismatics.org/collectionimages/19501999/1985/1985.140.97.rev.width175.jpg,https://numismatics.org/collectionimages/19501999/1985/1985.140.97.obv.width350.jpg,https://numismatics.org/collectionimages/19501999/1985/1985.140.97.rev.width350.jpg,,,https://images.numismatics.org/collectionimages%2F19501999%2F1985%2F1985.140.97.obv.noscale.jpg/info.json,https://images.numismatics.org/collectionimages%2F19501999%2F1985%2F1985.140.97.rev.noscale.jpg/info.json,,
http://numismatics.org/collection/1970.156.312,"Silver Denarius of Hadrian, Rome, AD 120 - AD 121 1970.156.312",1970.156.312,,,,American Numismatic Society,American Numismatic Society,http://numismatics.org/search/,American Numismatic Society,3.22,7,17.0,https://numismatics.org/collectionimages/19501999/1970/1970.156.312.obv.width175.jpg,https://numismatics.org/collectionimages/19501999/1970/1970.156.312.rev.width175.jpg,https://numismatics.org/collectionimages/19501999/1970/1970.156.312.obv.width350.jpg,https://numismatics.org/collectionimages/19501999/1970/1970.156.312.rev.width350.jpg,,,https://images.numismatics.org/collectionimages%2F19501999%2F1970%2F1970.156.312.obv.noscale.jpg/info.json,https://images.numismatics.org/collectionimages%2F19501999%2F1970%2F1970.156.312.rev.noscale.jpg/info.json,,
http://numismatics.org/collection/1956.127.1757,"Silver Denarius of Hadrian, Rome, AD 120 - AD 121 1956.127.1757",1956.127.1757,,,,American Numismatic Society,American Numismatic Society,http://numismatics.org/search/,American Numismatic Society,3.08,7,17.5,https://numismatics.org/collectionimages/19501999/1956/1956.127.1757.obv.width175.jpg,https://numismatics.org/collectionimages/19501999/1956/1956.127.1757.rev.width175.jpg,https://numismatics.org/collectionimages/19501999/1956/1956.127.1757.obv.width350.jpg,https://numismatics.org/collectionimages/19501999/1956/1956.127.1757.rev.width350.jpg,,,https://images.numismatics.org/collectionimages%2F19501999%2F1956%2F1956.127.1757.obv.noscale.jpg/info.json,https://images.numismatics.org/collectionimages%2F19501999%2F1956%2F1956.127.1757.rev.noscale.jpg/info.json,,
http://numismatics.org/collection/1911.23.97,"Silver Denarius of Hadrian, Rome, AD 120 - AD 121 1911.23.97",1911.23.97,,,,American Numismatic Society,American Numismatic Society,http://numismatics.org/search/,American Numismatic Society,3.49,7,18.0,https://numismatics.org/collectionimages/19001949/1911/1911.23.97.obv.width175.jpg,https://numismatics.org/collectionimages/19001949/1911/1911.23.97.rev.width175.jpg,https://numismatics.org/collectionimages/19001949/1911/1911.23.97.obv.width350.jpg,https://numismatics.org/collectionimages/19001949/1911/1911.23.97.rev.width350.jpg,,,https://images.numismatics.org/collectionimages%2F19001949%2F1911%2F1911.23.97.obv.noscale.jpg/info.json,https://images.numismatics.org/collectionimages%2F19001949%2F1911%2F1911.23.97.rev.noscale.jpg/info.json,,
https://hdl.handle.net/428894.vzg/a1fbee7b-9de8-425c-aca9-d92c9f274ffe,"Münze, Denar, 119 - 122 n. Chr.",129314,,,,Münzkabinett der Universität Göttingen,KENOM,http://www.kenom.de/,KENOM,2.722,5,,"https://www.kenom.de/iiif/image/record_DE-MUS-062622_kenom_129314/record_DE-MUS-062622_kenom_129314_vs.jpg/full/120,/0/default.jpg","https://www.kenom.de/iiif/image/record_DE-MUS-062622_kenom_129314/record_DE-MUS-062622_kenom_129314_rs.jpg/full/120,/0/default.jpg","https://www.kenom.de/iiif/image/record_DE-MUS-062622_kenom_129314/record_DE-MUS-062622_kenom_129314_vs.jpg/full/600,/0/default.jpg","https://www.kenom.de/iiif/image/record_DE-MUS-062622_kenom_129314/record_DE-MUS-062622_kenom_129314_rs.jpg/full/600,/0/default.jpg",,,https://www.kenom.de/iiif/image/record_DE-MUS-062622_kenom_129314/record_DE-MUS-062622_kenom_129314_vs.jpg/info.json,https://www.kenom.de/iiif/image/record_DE-MUS-062622_kenom_129314/record_DE-MUS-062622_kenom_129314_rs.jpg/info.json,,
https://hdl.handle.net/428894.vzg/faf078ad-c6e6-4bde-836d-6df02483afa0,"Münze, Denar, 120 - 121 n. Chr.",397386,,,,Coin Cabinet of the Mainz City Archives,KENOM,http://www.kenom.de/,KENOM,3.39,6,18.2,"https://www.kenom.de/iiif/image/record_DE-1966_kenom_397386/record_DE-1966_kenom_397386_vs.jpg/full/120,/0/default.jpg","https://www.kenom.de/iiif/image/record_DE-1966_kenom_397386/record_DE-1966_kenom_397386_rs.jpg/full/120,/0/default.jpg","https://www.kenom.de/iiif/image/record_DE-1966_kenom_397386/record_DE-1966_kenom_397386_vs.jpg/full/600,/0/default.jpg","https://www.kenom.de/iiif/image/record_DE-1966_kenom_397386/record_DE-1966_kenom_397386_rs.jpg/full/600,/0/default.jpg",,,https://www.kenom.de/iiif/image/record_DE-1966_kenom_397386/record_DE-1966_kenom_397386_vs.jpg/info.json,https://www.kenom.de/iiif/image/record_DE-1966_kenom_397386/record_DE-1966_kenom_397386_rs.jpg/info.json,,
https://hdl.handle.net/428894.vzg/cdf1f27f-9058-4025-b38f-7a9d1dd3e016,"Münze, Denar, 119 - 122 n. Chr.",129333,,,,Münzkabinett der Universität Göttingen,KENOM,http://www.kenom.de/,KENOM,3.209,7,,"https://www.kenom.de/iiif/image/record_DE-MUS-062622_kenom_129333/record_DE-MUS-062622_kenom_129333_vs.jpg/full/120,/0/default.jpg","https://www.kenom.de/iiif/image/record_DE-MUS-062622_kenom_129333/record_DE-MUS-062622_kenom_129333_rs.jpg/full/120,/0/default.jpg","https://www.kenom.de/iiif/image/record_DE-MUS-062622_kenom_129333/record_DE-MUS-062622_kenom_129333_vs.jpg/full/600,/0/default.jpg","https://www.kenom.de/iiif/image/record_DE-MUS-062622_kenom_129333/record_DE-MUS-062622_kenom_129333_rs.jpg/full/600,/0/default.jpg",,,https://www.kenom.de/iiif/image/record_DE-MUS-062622_kenom_129333/record_DE-MUS-062622_kenom_129333_vs.jpg/info.json,https://www.kenom.de/iiif/image/record_DE-MUS-062622_kenom_129333/record_DE-MUS-062622_kenom_129333_rs.jpg/info.json,,
https://hdl.handle.net/428894.vzg/315b1275-332d-4332-943a-6acf08d722c0,"Münze, Denar, 119 - 122 n. Chr.",185457,,,,Münzkabinett der Universität Göttingen,KENOM,http://www.kenom.de/,KENOM,2.817,7,18.51,"https://www.kenom.de/iiif/image/record_DE-MUS-062622_kenom_185457/record_DE-MUS-062622_kenom_185457_vs.jpg/full/120,/0/default.jpg","https://www.kenom.de/iiif/image/record_DE-MUS-062622_kenom_185457/record_DE-MUS-062622_kenom_185457_rs.jpg/full/120,/0/default.jpg","https://www.kenom.de/iiif/image/record_DE-MUS-062622_kenom_185457/record_DE-MUS-062622_kenom_185457_vs.jpg/full/600,/0/default.jpg","https://www.kenom.de/iiif/image/record_DE-MUS-062622_kenom_185457/record_DE-MUS-062622_kenom_185457_rs.jpg/full/600,/0/default.jpg",,,https://www.kenom.de/iiif/image/record_DE-MUS-062622_kenom_185457/record_DE-MUS-062622_kenom_185457_vs.jpg/info.json,https://www.kenom.de/iiif/image/record_DE-MUS-062622_kenom_185457/record_DE-MUS-062622_kenom_185457_rs.jpg/info.json,,
https://www.ikmk.at/object?id=ID170867,Hadrianus 119–122 n. Chr.,ID170867,,,,Münzkabinett Wien,KHM Wien,https://www.ikmk.at,Interaktiver Katalog des Münzkabinetts,3.30,5,18,https://www.ikmk.at/image/ID170867/vs_opt.jpg,https://www.ikmk.at/image/ID170867/rs_thumb.jpg,https://www.ikmk.at/image/ID170867/vs_org.jpg,https://www.ikmk.at/image/ID170867/rs_org.jpg,,,,,,
https://www.ikmk.at/object?id=ID1346,Hadrianus 119–122 n. Chr.,ID1346,,,,Münzkabinett Wien,KHM Wien,https://www.ikmk.at,Interaktiver Katalog des Münzkabinetts,3.65,6,18,https://www.ikmk.at/image/ID1346/vs_opt.jpg,https://www.ikmk.at/image/ID1346/rs_thumb.jpg,https://www.ikmk.at/image/ID1346/vs_org.jpg,https://www.ikmk.at/image/ID1346/rs_org.jpg,,,,,,
https://www.ikmk.at/object?id=ID170864,Hadrianus 119–122 n. Chr.,ID170864,,,,Münzkabinett Wien,KHM Wien,https://www.ikmk.at,Interaktiver Katalog des Münzkabinetts,3.25,6,18,https://www.ikmk.at/image/ID170864/vs_opt.jpg,https://www.ikmk.at/image/ID170864/rs_thumb.jpg,https://www.ikmk.at/image/ID170864/vs_org.jpg,https://www.ikmk.at/image/ID170864/rs_org.jpg,,,,,,
https://www.ikmk.at/object?id=ID170866,Hadrianus 119–122 n. Chr.,ID170866,,,,Münzkabinett Wien,KHM Wien,https://www.ikmk.at,Interaktiver Katalog des Münzkabinetts,3.54,6,18,https://www.ikmk.at/image/ID170866/vs_opt.jpg,https://www.ikmk.at/image/ID170866/rs_thumb.jpg,https://www.ikmk.at/image/ID170866/vs_org.jpg,https://www.ikmk.at/image/ID170866/rs_org.jpg,,,,,,
https://www.ikmk.at/object?id=ID171329,Hadrianus 119–122 n. Chr.,ID171329,,,,Münzkabinett Wien,KHM Wien,https://www.ikmk.at,Interaktiver Katalog des Münzkabinetts,2.74,6,18,https://www.ikmk.at/image/ID171329/vs_opt.jpg,https://www.ikmk.at/image/ID171329/rs_thumb.jpg,https://www.ikmk.at/image/ID171329/vs_org.jpg,https://www.ikmk.at/image/ID171329/rs_org.jpg,,,,,,
https://www.ikmk.at/object?id=ID61148,Hadrianus 119–122 n. Chr.,ID61148,,,,Münzkabinett Wien,KHM Wien,https://www.ikmk.at,Interaktiver Katalog des Münzkabinetts,2.96,6,18,https://www.ikmk.at/image/ID61148/vs_opt.jpg,https://www.ikmk.at/image/ID61148/rs_thumb.jpg,https://www.ikmk.at/image/ID61148/vs_org.jpg,https://www.ikmk.at/image/ID61148/rs_org.jpg,,,,,,
https://www.ikmk.at/object?id=ID171328,Hadrianus 119–122 n. Chr.,ID171328,,,,Münzkabinett Wien,KHM Wien,https://www.ikmk.at,Interaktiver Katalog des Münzkabinetts,2.43,6,19,https://www.ikmk.at/image/ID171328/vs_opt.jpg,https://www.ikmk.at/image/ID171328/rs_thumb.jpg,https://www.ikmk.at/image/ID171328/vs_org.jpg,https://www.ikmk.at/image/ID171328/rs_org.jpg,,,,,,
https://www.ikmk.at/object?id=ID1348,Hadrianus 119–122 n. Chr.,ID1348,,,,Münzkabinett Wien,KHM Wien,https://www.ikmk.at,Interaktiver Katalog des Münzkabinetts,3.31,7,18,https://www.ikmk.at/image/ID1348/vs_opt.jpg,https://www.ikmk.at/image/ID1348/rs_thumb.jpg,https://www.ikmk.at/image/ID1348/vs_org.jpg,https://www.ikmk.at/image/ID1348/rs_org.jpg,,,,,,
https://www.ikmk.at/object?id=ID170865,Hadrianus 119–122 n. Chr.,ID170865,,,,Münzkabinett Wien,KHM Wien,https://www.ikmk.at,Interaktiver Katalog des Münzkabinetts,2.68,7,18,https://www.ikmk.at/image/ID170865/vs_opt.jpg,https://www.ikmk.at/image/ID170865/rs_thumb.jpg,https://www.ikmk.at/image/ID170865/vs_org.jpg,https://www.ikmk.at/image/ID170865/rs_org.jpg,,,,,,
https://www.ikmk.at/object?id=ID179066,Hadrianus 119–122 n. Chr.,ID179066,,,,Münzkabinett Wien,KHM Wien,https://www.ikmk.at,Interaktiver Katalog des Münzkabinetts,9.81,7,24,https://www.ikmk.at/image/ID179066/vs_opt.jpg,https://www.ikmk.at/image/ID179066/rs_thumb.jpg,https://www.ikmk.at/image/ID179066/vs_org.jpg,https://www.ikmk.at/image/ID179066/rs_org.jpg,,,,,,
https://ikmk-win.ch/object?id=ID1387,Hadrianus 120–121 n. Chr.,ID1387,,,,Münzkabinett und Antikensammlung der Stadt Winterthur,MK Winterthur,https://ikmk-win.ch,Interaktiver Katalog des Münzkabinetts der Stadt Winterthur,3.01,7,18,https://ikmk-win.ch/image/ID1387/vs_thumb.jpg,https://ikmk-win.ch/image/ID1387/rs_thumb.jpg,https://ikmk-win.ch/image/ID1387/vs_exp.jpg,https://ikmk-win.ch/image/ID1387/rs_exp.jpg,,,,,,
https://www.britishmuseum.org/collection/object/C_1924-0718-5,"British Museum: 1924,0718.5","1924,0718.5",,,,British Museum,Trustees of the British Museum,https://www.britishmuseum.org/,British Museum,2.91,6,,,,,,https://media.britishmuseum.org/media/Repository/Documents/2014_10/11_17/4009b9c2_a94e_4019_b126_a3c1011a05e6/small_00677254_001.jpg,https://media.britishmuseum.org/media/Repository/Documents/2014_10/11_17/4009b9c2_a94e_4019_b126_a3c1011a05e6/large_00677254_001.jpg,,,,
https://www.britishmuseum.org/collection/object/C_R-9724,British Museum: R.9724,R.9724,,,,British Museum,Trustees of the British Museum,https://www.britishmuseum.org/,British Museum,3.58,6,,,,,,https://media.britishmuseum.org/media/Repository/Documents/2014_10/11_17/a23298a6_87a8_4362_957c_a3c1011a08c9/small_00677256_001.jpg,https://media.britishmuseum.org/media/Repository/Documents/2014_10/11_17/a23298a6_87a8_4362_957c_a3c1011a08c9/large_00677256_001.jpg,,,,
https://www.britishmuseum.org/collection/object/C_BNK-R-362,"British Museum: BNK,R.362","BNK,R.362",,,,British Museum,Trustees of the British Museum,https://www.britishmuseum.org/,British Museum,3.06,6,,,,,,https://media.britishmuseum.org/media/Repository/Documents/2014_10/11_17/b20a78b2_1832_4ff1_bccf_a3c1011a09f5/small_00677257_001.jpg,https://media.britishmuseum.org/media/Repository/Documents/2014_10/11_17/b20a78b2_1832_4ff1_bccf_a3c1011a09f5/large_00677257_001.jpg,,,,
https://www.britishmuseum.org/collection/object/C_R-9723,British Museum: R.9723,R.9723,,,,British Museum,Trustees of the British Museum,https://www.britishmuseum.org/,British Museum,3.47,6,,,,,,https://media.britishmuseum.org/media/Repository/Documents/2014_10/11_17/c3486290_8d1c_47df_bbab_a3c1011a0786/small_00677255_001.jpg,https://media.britishmuseum.org/media/Repository/Documents/2014_10/11_17/c3486290_8d1c_47df_bbab_a3c1011a0786/large_00677255_001.jpg,,,,
https://www.britishmuseum.org/collection/object/C_1994-0915-363,"British Museum: 1994,0915.363","1994,0915.363",,,,British Museum,Trustees of the British Museum,https://www.britishmuseum.org/,British Museum,2.82,6,,,,,,https://media.britishmuseum.org/media/Repository/Documents/2014_10/11_6/094678e9_ae45_4ebb_b129_a3c1007219a4/small_00611365_001.jpg,https://media.britishmuseum.org/media/Repository/Documents/2014_10/11_6/094678e9_ae45_4ebb_b129_a3c1007219a4/large_00611365_001.jpg,,,,
https://www.britishmuseum.org/collection/object/C_2009-4175-8,"British Museum: 2009,4175.8","2009,4175.8",,,,British Museum,Trustees of the British Museum,https://www.britishmuseum.org/,British Museum,2.53,6,,,,,,https://media.britishmuseum.org/media/Repository/Documents/2014_10/13_7/6a0aaf0e_f016_4942_b0f0_a3c3007bbc4f/small_00781053_001.jpg,https://media.britishmuseum.org/media/Repository/Documents/2014_10/13_7/6a0aaf0e_f016_4942_b0f0_a3c3007bbc4f/00781053_001.jpg,,,,
https://finds.org.uk/database/artefacts/record/id/22606,22606: PAS Coin,22606,http://www.wikidata.org/entity/Q1853853,West Somerset,,,Trustees of the British Museum,https://finds.org.uk/,Portable Antiquities Scheme,2.68,6,18.03,,,,,,https://finds.org.uk/images/caht/SOMDOR220a.jpg,,,,
https://finds.org.uk/database/artefacts/record/id/826464,826464: PAS Coin,826464,http://www.wikidata.org/entity/Q8026475,Winteringham,,,Trustees of the British Museum,https://finds.org.uk/,Portable Antiquities Scheme,2.81,6,18.7,,,,,,https://finds.org.uk/images/mforeman/NLM34907.jpg,,,,
https://finds.org.uk/database/artefacts/record/id/974727,974727: PAS Coin,974727,http://www.wikidata.org/entity/Q596641,Upton Warren,,,Trustees of the British Museum,https://finds.org.uk/,Portable Antiquities Scheme,2.64,7,18.77,,,,,,https://finds.org.uk/images/abolton/WAWF8CC27.jpg,,,,
https://finds.org.uk/database/artefacts/record/id/883401,883401: PAS Coin,883401,http://www.wikidata.org/entity/Q56295096,Chelsfield and Pratts Bottom,,,Trustees of the British Museum,https://finds.org.uk/,Portable Antiquities Scheme,1.79,7,19.04,,,,,,https://finds.org.uk/images/ucljo/KENTCE9BCC.jpg,,,,
https://mk-bochum.ikmk.net/object?id=ID450,Hadrianus 120-121 n. Chr.,ID450||ID450,,,,Coin Collection of Ruhr-Universität Bochum,Universität Bochum,https://mk-bochum.ikmk.net,Das Digitale Münzkabinett der Universität Bochum,3.36,6,18,https://mk-bochum.ikmk.net/image/ID450/vs_thumb.jpg,https://mk-bochum.ikmk.net/image/ID450/rs_thumb.jpg,https://mk-bochum.ikmk.net/image/ID450/vs_exp.jpg,https://mk-bochum.ikmk.net/image/ID450/rs_exp.jpg,,,,,,
https://ikmk.uni-freiburg.de/object?id=ID3452,Hadrianus 120-121 n. Chr.,ID3452,,,,Münzsammlung des Seminars für Alte Geschichte der Albert-Ludwigs-Universität,Universität Freiburg,https://ikmk.uni-freiburg.de,Interaktiver Katalog der Münzsammlung,2.89,7,18,https://ikmk.uni-freiburg.de/image/ID3452/vs_thumb.jpg,https://ikmk.uni-freiburg.de/image/ID3452/rs_thumb.jpg,https://ikmk.uni-freiburg.de/image/ID3452/vs_exp.jpg,https://ikmk.uni-freiburg.de/image/ID3452/rs_exp.jpg,,,,,,
https://www.univie.ac.at/ikmk/object?id=ID687,Hadrian 120-121 n. Chr.,ID687,,,,Department of Numismatics and Monetary History at the University of Vienna,Universität Wien,https://www.univie.ac.at/ikmk,Das Digitale Münzkabinett des Instituts für Numismatik und Geldgeschichte,2.10,6,17,https://www.univie.ac.at/ikmk/image/ID687/vs_thumb.jpg,https://www.univie.ac.at/ikmk/image/ID687/rs_thumb.jpg,https://www.univie.ac.at/ikmk/image/ID687/vs_exp.jpg,https://www.univie.ac.at/ikmk/image/ID687/rs_exp.jpg,,,,,,
